Reaction Details
TargetKappa-type opioid receptor
LigandBDBM50174945
Substrate/Competitorn/a
Meas. Tech.ChEMBL_325672 (CHEMBL863226)
Ki 3.6±n/a nM
Citation Chu, GHGu, MCassel, JABelanger, SGraczyk, TMDeHaven, RNConway-James, NKoblish, MLittle, PJDeHaven-Hudkins, DLDolle, RE Potent and highly selective kappa opioid receptor agonists incorporating chroman- and 2,3-dihydrobenzofuran-based constraints. Bioorg Med Chem Lett15:5114-9 (2005) 
 
Kappa-type opioid receptor
Name:Kappa-type opioid receptor
Type:G Protein-Coupled Receptor (GPCR)
Mol. Mass.:42648.76
Organism:Homo sapiens (Human)
Description:P41145
Residue:380
BDBM50174945
NameBDBM50174945
Synonyms:(R)-N-((S)-2-((S)-3-hydroxypyrrolidin-1-yl)-1-phenylethyl)-N-methyl-5-(propylsulfonamidomethyl)-2,3-dihydrobenzofuran-2-carboxamide | CHEMBL371467
TypeSmall organic molecule
Emp. Form.C26H35N3O5S
Mol. Mass.501.638
SMILESCCCS(=O)(=O)NCc1ccc2O[C@H](Cc2c1)C(=O)N(C)[C@H](CN1CC[C@H](O)C1)c1ccccc1