Reaction Details
TargetMu-type opioid receptor
LigandBDBM50174954
Substrate/Competitorn/a
Meas. Tech.ChEMBL_325673 (CHEMBL863227)
Ki>5000±n/a nM
Citation Chu, GHGu, MCassel, JABelanger, SGraczyk, TMDeHaven, RNConway-James, NKoblish, MLittle, PJDeHaven-Hudkins, DLDolle, RE Potent and highly selective kappa opioid receptor agonists incorporating chroman- and 2,3-dihydrobenzofuran-based constraints. Bioorg Med Chem Lett15:5114-9 (2005) 
 
Mu-type opioid receptor
Name:Mu-type opioid receptor
Type:G Protein-Coupled Receptor (GPCR)
Mol. Mass.:44789.51
Organism:Homo sapiens (Human)
Description:P35372
Residue:400
BDBM50174954
NameBDBM50174954
Synonyms:(S)-N-((S)-2-((S)-3-hydroxypyrrolidin-1-yl)-1-phenylethyl)-N-methyl-6-(methylsulfonamidomethyl)chroman-2-carboxamide | CHEMBL200442
TypeSmall organic molecule
Emp. Form.C25H33N3O5S
Mol. Mass.487.612
SMILESCN([C@H](CN1CC[C@H](O)C1)c1ccccc1)C(=O)[C@@H]1CCc2cc(CNS(C)(=O)=O)ccc2O1