Reaction Details
TargetMu-type opioid receptor
LigandBDBM50174946
Substrate/Competitorn/a
Meas. Tech.ChEMBL_325673 (CHEMBL863227)
Ki>5000±n/a nM
Citation Chu, GHGu, MCassel, JABelanger, SGraczyk, TMDeHaven, RNConway-James, NKoblish, MLittle, PJDeHaven-Hudkins, DLDolle, RE Potent and highly selective kappa opioid receptor agonists incorporating chroman- and 2,3-dihydrobenzofuran-based constraints. Bioorg Med Chem Lett15:5114-9 (2005) 
 
Mu-type opioid receptor
Name:Mu-type opioid receptor
Type:G Protein-Coupled Receptor (GPCR)
Mol. Mass.:44789.51
Organism:Homo sapiens (Human)
Description:P35372
Residue:400
BDBM50174946
NameBDBM50174946
Synonyms:CHEMBL197293 | methyl 2-(((S)-2-((S)-3-hydroxypyrrolidin-1-yl)-1-phenylethyl)(methyl)carbamoyl)chroman-6-ylcarbamate
TypeSmall organic molecule
Emp. Form.C25H31N3O5
Mol. Mass.453.5307
SMILESCOC(=O)Nc1ccc2OC(CCc2c1)C(=O)N(C)[C@H](CN1CC[C@H](O)C1)c1ccccc1