Reaction Details
TargetCytochrome P450 2D6
LigandBDBM50174958
Substrate/Competitorn/a
Meas. Tech.ChEMBL_325677 (CHEMBL863231)
IC50 1600±n/a nM
Citation Chu, GHGu, MCassel, JABelanger, SGraczyk, TMDeHaven, RNConway-James, NKoblish, MLittle, PJDeHaven-Hudkins, DLDolle, RE Potent and highly selective kappa opioid receptor agonists incorporating chroman- and 2,3-dihydrobenzofuran-based constraints. Bioorg Med Chem Lett15:5114-9 (2005) 
 
Cytochrome P450 2D6
Name:Cytochrome P450 2D6
Type:Protein
Mol. Mass.:55774.82
Organism:Homo sapiens (Human)
Description:P10635
Residue:497
BDBM50174958
NameBDBM50174958
Synonyms:(S)-N-((S)-2-((S)-3-hydroxypyrrolidin-1-yl)-1-phenylethyl)-N-methylchroman-2-carboxamide | CHEMBL381198
TypeSmall organic molecule
Emp. Form.C23H28N2O3
Mol. Mass.380.48
SMILESCN([C@H](CN1CC[C@H](O)C1)c1ccccc1)C(=O)[C@@H]1CCc2ccccc2O1