Reaction Details
TargetDimer of Protein farnesyltransferase subunit beta
LigandBDBM50175402
Substrate/Competitorn/a
Meas. Tech.ChEMBL_326981 (CHEMBL860145)
IC50 0.9±n/a nM
Citation Saha, AKLiu, LSimoneaux, RDeCorte, BMeyer, CSkrzat, SBreslin, HJKukla, MJEnd, DW Novel triazole based inhibitors of Ras farnesyl transferase. Bioorg Med Chem Lett15:5407-11 (2005) 
 
Dimer of Protein farnesyltransferase subunit beta
Name:Dimer of Protein farnesyltransferase subunit beta
Synonyms:Protein Farnesyltransferase (PFT) Chain B
Type:n/a
Mol. Mass.:n/a
Description:ASSAY_ID of EBI is 51428
Components:This complex has 3 components.
Component 1
Name:Protein farnesyltransferase subunit beta
Type:Enzyme Subunit
Mol. Mass.:48766.02
Organism:Homo sapiens (Human)
Description:Protein farnesyltransferase subunit beta
Residue:437
Component 2
Name:Protein farnesyltransferase subunit beta
Synonyms:CAAX farnesyltransferase subunit alpha FNTB FTase-alpha GGTase-I-alpha Protein farnesyl/geranylgeranyl transferase Protein farnesyltransferase subunit beta Protein farnesyltransferase/geranylgeranyltransferase type-1 subunit alpha Ras proteins prenyltransferase subunit beta | Type I protein geranyl-geranyltransferase subunit alpha
Type:Enzyme Subunit
Mol. Mass.:48766.02
Organism:Homo sapiens (Human)
Description:Protein farnesyltransferase subunit beta
Residue:437
BDBM50175402
NameBDBM50175402
Synonyms:CHEMBL371435 | N-(2,4-difluorobenzyl)-N-((4-(4-cyanobenzyl)-5-methyl-4H-1,2,4-triazol-3-yl)methyl)quinoline-2-carboxamide
TypeSmall organic molecule
Emp. Form.C29H22F2N6O
Mol. Mass.508.5214
SMILESCc1nnc(CN(Cc2ccc(F)cc2F)C(=O)c2ccc3ccccc3n2)n1Cc1ccc(cc1)C#N