Reaction Details
TargetMethionine aminopeptidase
LigandBDBM50175451
Substrate/Competitorn/a
Meas. Tech.ChEMBL_326947 (CHEMBL853289)
IC50 173000±n/a nM
Citation Huang, QQHuang, MNan, FJYe, QZ Metalloform-selective inhibition: synthesis and structure-activity analysis of Mn(II)-form-selective inhibitors of Escherichia coli methionine aminopeptidase. Bioorg Med Chem Lett15:5386-91 (2005) 
 
Methionine aminopeptidase
Name:Methionine aminopeptidase
Type:Enzyme
Mol. Mass.:29326.96
Organism:Escherichia coli (strain K12)
Description:Full-length untagged EcMAP was expressed in E. coli.
Residue:264
BDBM50175451
NameBDBM50175451
Synonyms:5-(2,5-DICHLOROPHENYL)-2-FUROIC ACID CHEMBL370437
TypeSmall organic molecule
Emp. Form.C11H6Cl2O3
Mol. Mass.257.07
SMILESOC(=O)c1ccc(o1)-c1cc(Cl)ccc1Cl