Reaction Details
TargetInterstitial collagenase
LigandBDBM50175547
Substrate/Competitorn/a
Meas. Tech.ChEMBL_320812 (CHEMBL872347)
Ki 33±n/a nM
Citation Alberts, ILTodorov, NPDean, PM Receptor flexibility in de novo ligand design and docking. J Med Chem48:6585-96 (2005) 
 
Interstitial collagenase
Name:Interstitial collagenase
Type:Enzyme
Mol. Mass.:54010.26
Organism:Homo sapiens (Human)
Description: P03956
Residue:469
BDBM50175547
NameBDBM50175547
Synonyms:CHEMBL198048 | N-Hydroxycarbamoylmethyl-4-methoxy-benzamide
TypeSmall organic molecule
Emp. Form.C10H12N2O4
Mol. Mass.224.2133
SMILESCOc1ccc(cc1)C(=O)NCC(=O)NO