Reaction Details
TargetSodium-dependent dopamine transporter
LigandBDBM50175648
Substrate/Competitorn/a
Meas. Tech.ChEMBL_329125 (CHEMBL863424)
Ki 7.14±n/a nM
Citation Tamagnan, GAlagille, DFu, XKula, NSBaldessarini, RJInnis, RBBaldwin, RM Synthesis and monoamine transporter affinity of new 2beta-carbomethoxy-3beta-[aryl or heteroaryl]phenyltropanes. Bioorg Med Chem Lett16:217-20 (2005) 
 
Sodium-dependent dopamine transporter
Name:Sodium-dependent dopamine transporter
Type:Multi-pass membrane protein
Mol. Mass.:68749.45
Organism:Rattus norvegicus (rat)
Description:P23977
Residue:619
BDBM50175648
NameBDBM50175648
Synonyms:CHEMBL199704 | methyl 3-(4-(furan-2-yl)phenyl)-8-methyl-8-aza-bicyclo[3.2.1]octane-2-carboxylate
TypeSmall organic molecule
Emp. Form.C20H23NO3
Mol. Mass.325.4015
SMILESCOC(=O)C1C2CCC(CC1c1ccc(cc1)-c1ccco1)N2C