Reaction Details
TargetSodium-dependent serotonin transporter
LigandBDBM50175647
Substrate/Competitorn/a
Meas. Tech.ChEMBL_329124 (CHEMBL863423)
Ki 1.67±n/a nM
Citation Tamagnan, GAlagille, DFu, XKula, NSBaldessarini, RJInnis, RBBaldwin, RM Synthesis and monoamine transporter affinity of new 2beta-carbomethoxy-3beta-[aryl or heteroaryl]phenyltropanes. Bioorg Med Chem Lett16:217-20 (2005) 
 
Sodium-dependent serotonin transporter
Name:Sodium-dependent serotonin transporter
Type:Multi-pass membrane protein
Mol. Mass.:70168.43
Organism:Rattus norvegicus (rat)
Description:P31652
Residue:630
BDBM50175647
NameBDBM50175647
Synonyms:CHEMBL382943 | methyl 8-methyl-3-(4-(thiazol-2-yl)phenyl)-8-aza-bicyclo[3.2.1]octane-2-carboxylate
TypeSmall organic molecule
Emp. Form.C19H22N2O2S
Mol. Mass.342.455
SMILESCOC(=O)C1C2CCC(CC1c1ccc(cc1)-c1nccs1)N2C