Reaction Details
TargetFructose-bisphosphate aldolase A
LigandBDBM50175714
Substrate/Competitorn/a
Meas. Tech.ChEMBL_326982 (CHEMBL867575)
Ki>10000000±n/a nM
Citation Gavalda, SBraga, RDax, CVigroux, ABlonski, C N-Sulfonyl hydroxamate derivatives as inhibitors of class II fructose-1,6-diphosphate aldolase. Bioorg Med Chem Lett15:5375-7 (2005) 
 
Fructose-bisphosphate aldolase A
Name:Fructose-bisphosphate aldolase A
Type:PROTEIN
Mol. Mass.:39351.00
Organism:Oryctolagus cuniculus
Description:ChEMBL_813854
Residue:364
BDBM50175714
NameBDBM50175714
Synonyms:2-(methylsulfonamido)-2-oxoethyl dihydrogen phosphate | CHEMBL370845
TypeSmall organic molecule
Emp. Form.C3H8NO7PS
Mol. Mass.233.137
SMILESCS(=O)(=O)NC(=O)COP(O)(O)=O