Reaction Details
TargetDelta-type opioid receptor
LigandBDBM50175716
Substrate/Competitorn/a
Meas. Tech.ChEMBL_328876 (CHEMBL859855)
Ki 217±n/a nM
Citation Trabanco, AAPullan, SAlonso, JMAlvarez, RMAndrés, JIBoeckx, IFernández, JGómez, AIturrino, LJanssens, FELeenaerts, JEDe Lucas, AIMatesanz, EMeert, TSteckler, T 4-Phenyl-4-[1H-imidazol-2-yl]-piperidine derivatives, a novel class of selective delta-opioid agonists. Bioorg Med Chem Lett16:146-9 (2005) 
 
Delta-type opioid receptor
Name:Delta-type opioid receptor
Type:G Protein-Coupled Receptor (GPCR)
Mol. Mass.:40382.98
Organism:Homo sapiens (Human)
Description:Competition binding assays were carried out using membrane preparations from transfected HN9.10 cells that constitutively expressed the delta opioid receptor.
Residue:372
BDBM50175716
NameBDBM50175716
Synonyms:4-(1-(3-methoxybenzyl)-1H-imidazol-2-yl)-N,4-diphenylpiperidine-1-carboxamide | CHEMBL199289
TypeSmall organic molecule
Emp. Form.C29H30N4O2
Mol. Mass.466.5741
SMILESCOc1cccc(Cn2ccnc2C2(CCN(CC2)C(=O)Nc2ccccc2)c2ccccc2)c1