Reaction Details
TargetDelta-type opioid receptor
LigandBDBM50175728
Substrate/Competitorn/a
Meas. Tech.ChEMBL_328876 (CHEMBL859855)
Ki 44±n/a nM
Citation Trabanco, AAPullan, SAlonso, JMAlvarez, RMAndrés, JIBoeckx, IFernández, JGómez, AIturrino, LJanssens, FELeenaerts, JEDe Lucas, AIMatesanz, EMeert, TSteckler, T 4-Phenyl-4-[1H-imidazol-2-yl]-piperidine derivatives, a novel class of selective delta-opioid agonists. Bioorg Med Chem Lett16:146-9 (2005) 
 
Delta-type opioid receptor
Name:Delta-type opioid receptor
Type:G Protein-Coupled Receptor (GPCR)
Mol. Mass.:40382.98
Organism:Homo sapiens (Human)
Description:Competition binding assays were carried out using membrane preparations from transfected HN9.10 cells that constitutively expressed the delta opioid receptor.
Residue:372
BDBM50175728
NameBDBM50175728
Synonyms:4-(1-benzyl-1H-imidazol-2-yl)-N-(4-methoxyphenyl)-4-phenylpiperidine-1-carboxamide | CHEMBL434174
TypeSmall organic molecule
Emp. Form.C29H30N4O2
Mol. Mass.466.5741
SMILESCOc1ccc(NC(=O)N2CCC(CC2)(c2nccn2Cc2ccccc2)c2ccccc2)cc1