Reaction Details
TargetKappa-type opioid receptor
LigandBDBM50175735
Substrate/Competitorn/a
Meas. Tech.ChEMBL_328878 (CHEMBL859857)
Ki 116±n/a nM
Citation Trabanco, AAPullan, SAlonso, JMAlvarez, RMAndrés, JIBoeckx, IFernández, JGómez, AIturrino, LJanssens, FELeenaerts, JEDe Lucas, AIMatesanz, EMeert, TSteckler, T 4-Phenyl-4-[1H-imidazol-2-yl]-piperidine derivatives, a novel class of selective delta-opioid agonists. Bioorg Med Chem Lett16:146-9 (2005) 
 
Kappa-type opioid receptor
Name:Kappa-type opioid receptor
Type:G Protein-Coupled Receptor (GPCR)
Mol. Mass.:42648.76
Organism:Homo sapiens (Human)
Description:P41145
Residue:380
BDBM50175735
NameBDBM50175735
Synonyms:4-(1-(2-fluorobenzyl)-1H-imidazol-2-yl)-N,4-diphenylpiperidine-1-carboxamide | CHEMBL199871
TypeSmall organic molecule
Emp. Form.C28H27FN4O
Mol. Mass.454.5386
SMILESFc1ccccc1Cn1ccnc1C1(CCN(CC1)C(=O)Nc1ccccc1)c1ccccc1