Reaction Details
TargetMu-type opioid receptor
LigandBDBM50175734
Substrate/Competitorn/a
Meas. Tech.ChEMBL_328877 (CHEMBL859856)
Ki>4652±n/a nM
Citation Trabanco, AAPullan, SAlonso, JMAlvarez, RMAndrés, JIBoeckx, IFernández, JGómez, AIturrino, LJanssens, FELeenaerts, JEDe Lucas, AIMatesanz, EMeert, TSteckler, T 4-Phenyl-4-[1H-imidazol-2-yl]-piperidine derivatives, a novel class of selective delta-opioid agonists. Bioorg Med Chem Lett16:146-9 (2005) 
 
Mu-type opioid receptor
Name:Mu-type opioid receptor
Type:G Protein-Coupled Receptor (GPCR)
Mol. Mass.:44789.51
Organism:Homo sapiens (Human)
Description:P35372
Residue:400
BDBM50175734
NameBDBM50175734
Synonyms:4-(1-benzyl-1H-imidazol-2-yl)-4-phenyl-1-(thiazol-2-yl)piperidine | CHEMBL436323
TypeSmall organic molecule
Emp. Form.C24H24N4S
Mol. Mass.400.539
SMILESC(c1ccccc1)n1ccnc1C1(CCN(CC1)c1nccs1)c1ccccc1