Reaction Details
TargetMu-type opioid receptor
LigandBDBM50175731
Substrate/Competitorn/a
Meas. Tech.ChEMBL_328877 (CHEMBL859856)
Ki>4652±n/a nM
Citation Trabanco, AAPullan, SAlonso, JMAlvarez, RMAndrés, JIBoeckx, IFernández, JGómez, AIturrino, LJanssens, FELeenaerts, JEDe Lucas, AIMatesanz, EMeert, TSteckler, T 4-Phenyl-4-[1H-imidazol-2-yl]-piperidine derivatives, a novel class of selective delta-opioid agonists. Bioorg Med Chem Lett16:146-9 (2005) 
 
Mu-type opioid receptor
Name:Mu-type opioid receptor
Type:G Protein-Coupled Receptor (GPCR)
Mol. Mass.:44789.51
Organism:Homo sapiens (Human)
Description:P35372
Residue:400
BDBM50175731
NameBDBM50175731
Synonyms:4-(1-benzyl-1H-imidazol-2-yl)-N-ethyl-4-phenylpiperidine-1-carboxamide | CHEMBL198238
TypeSmall organic molecule
Emp. Form.C24H28N4O
Mol. Mass.388.5053
SMILESCCNC(=O)N1CCC(CC1)(c1nccn1Cc1ccccc1)c1ccccc1