Reaction Details
TargetMu-type opioid receptor
LigandBDBM50175726
Substrate/Competitorn/a
Meas. Tech.ChEMBL_328877 (CHEMBL859856)
Ki>465±n/a nM
Citation Trabanco, AAPullan, SAlonso, JMAlvarez, RMAndrés, JIBoeckx, IFernández, JGómez, AIturrino, LJanssens, FELeenaerts, JEDe Lucas, AIMatesanz, EMeert, TSteckler, T 4-Phenyl-4-[1H-imidazol-2-yl]-piperidine derivatives, a novel class of selective delta-opioid agonists. Bioorg Med Chem Lett16:146-9 (2005) 
 
Mu-type opioid receptor
Name:Mu-type opioid receptor
Type:G Protein-Coupled Receptor (GPCR)
Mol. Mass.:44789.51
Organism:Homo sapiens (Human)
Description:P35372
Residue:400
BDBM50175726
NameBDBM50175726
Synonyms:4-(1H-imidazol-2-yl)-N,4-diphenylpiperidine-1-carboxamide | CHEMBL199738
TypeSmall organic molecule
Emp. Form.C21H22N4O
Mol. Mass.346.4256
SMILESO=C(Nc1ccccc1)N1CCC(CC1)(c1ncc[nH]1)c1ccccc1