Reaction Details
TargetKappa-type opioid receptor
LigandBDBM50175740
Substrate/Competitorn/a
Meas. Tech.ChEMBL_328878 (CHEMBL859857)
Ki 152±n/a nM
Citation Trabanco, AAPullan, SAlonso, JMAlvarez, RMAndrés, JIBoeckx, IFernández, JGómez, AIturrino, LJanssens, FELeenaerts, JEDe Lucas, AIMatesanz, EMeert, TSteckler, T 4-Phenyl-4-[1H-imidazol-2-yl]-piperidine derivatives, a novel class of selective delta-opioid agonists. Bioorg Med Chem Lett16:146-9 (2005) 
 
Kappa-type opioid receptor
Name:Kappa-type opioid receptor
Type:G Protein-Coupled Receptor (GPCR)
Mol. Mass.:42648.76
Organism:Homo sapiens (Human)
Description:P41145
Residue:380
BDBM50175740
NameBDBM50175740
Synonyms:4-(1-benzyl-1H-imidazol-2-yl)-N-(3-methoxyphenyl)-4-phenylpiperidine-1-carboxamide | CHEMBL200098
TypeSmall organic molecule
Emp. Form.C29H30N4O2
Mol. Mass.466.5741
SMILESCOc1cccc(NC(=O)N2CCC(CC2)(c2nccn2Cc2ccccc2)c2ccccc2)c1