Reaction Details
TargetMitogen-activated protein kinase 1
LigandBDBM50175778
Substrate/Competitorn/a
Meas. Tech.ChEMBL_328159 (CHEMBL863939)
IC50 1400±n/a nM
Citation Kinoshita, TWarizaya, MOhori, MSato, KNeya, MFujii, T Crystal structure of human ERK2 complexed with a pyrazolo[3,4-c]pyridazine derivative. Bioorg Med Chem Lett16:55-8 (2005) 
 
Mitogen-activated protein kinase 1
Name:Mitogen-activated protein kinase 1
Type:Ser/Thr Protein Kinase
Mol. Mass.:41392.76
Organism:Homo sapiens (Human)
Description:P28482
Residue:360
BDBM50175778
NameBDBM50175778
Synonyms:1-methyl-5-(2-phenylH-pyrazolo[1,5-a]pyridin-3-yl)-1H-pyrazolo[3,4-c]pyridazin-3-amine | CHEMBL370379
TypeSmall organic molecule
Emp. Form.C19H15N7
Mol. Mass.341.3693
SMILESCn1nc(N)c2cc(nnc12)-c1c(nn2ccccc12)-c1ccccc1