Reaction Details
TargetHistamine H3 receptor
LigandBDBM50175837
Substrate/Competitorn/a
Meas. Tech.ChEMBL_327753 (CHEMBL861794)
Ki 5±n/a nM
Citation Vaccaro, WDSher, RBerlin, MShih, NYAslanian, RSchwerdt, JHMcCormick, KDPiwinski, JJWest, REAnthes, JCWilliams, SMWu, RLShe, HSRivelli, MAMutter, JCCorboz, MRHey, JAFavreau, L Novel histamine H3 receptor antagonists based on the 4-[(1H-imidazol-4-yl)methyl]piperidine scaffold. Bioorg Med Chem Lett16:395-9 (2005) 
 
Histamine H3 receptor
Name:Histamine H3 receptor
Type:Enzyme Catalytic Domain
Mol. Mass.:48753.61
Organism:GUINEA PIG
Description:HISTAMINE H3 HRH3 GUINEA PIG::Q9JI35
Residue:445
BDBM50175837
NameBDBM50175837
Synonyms:1-(4-((1H-imidazol-4-yl)methyl)piperidin-1-yl)-3-phenoxypropan-1-one | CHEMBL380584
TypeSmall organic molecule
Emp. Form.C18H23N3O2
Mol. Mass.313.3941
SMILESO=C(CCOc1ccccc1)N1CCC(Cc2cnc[nH]2)CC1