Reaction Details
TargetHistamine H3 receptor
LigandBDBM50175838
Substrate/Competitorn/a
Meas. Tech.ChEMBL_327753 (CHEMBL861794)
Ki 5±n/a nM
Citation Vaccaro, WDSher, RBerlin, MShih, NYAslanian, RSchwerdt, JHMcCormick, KDPiwinski, JJWest, REAnthes, JCWilliams, SMWu, RLShe, HSRivelli, MAMutter, JCCorboz, MRHey, JAFavreau, L Novel histamine H3 receptor antagonists based on the 4-[(1H-imidazol-4-yl)methyl]piperidine scaffold. Bioorg Med Chem Lett16:395-9 (2005) 
 
Histamine H3 receptor
Name:Histamine H3 receptor
Type:Enzyme Catalytic Domain
Mol. Mass.:48753.61
Organism:GUINEA PIG
Description:HISTAMINE H3 HRH3 GUINEA PIG::Q9JI35
Residue:445
BDBM50175838
NameBDBM50175838
Synonyms:4-((1H-imidazol-4-yl)methyl)-1-(4-phenylbutyl)piperidine | CHEMBL200189
TypeSmall organic molecule
Emp. Form.C19H27N3
Mol. Mass.297.4378
SMILESC(CCc1ccccc1)CN1CCC(Cc2cnc[nH]2)CC1