Reaction Details
TargetSodium-dependent serotonin transporter
LigandBDBM50176032
Substrate/Competitorn/a
Meas. Tech.ChEMBL_320901 (CHEMBL872400)
Ki 1.1±n/a nM
Citation Smid, PCoolen, HKKeizer, HGvan Hes, Rde Moes, JPden Hartog, APStork, BPlekkenpol, RHNiemann, LCStroomer, CNTulp, MTvan Stuivenberg, HHMcCreary, ACHesselink, MBHerremans, AHKruse, CG Synthesis, structure-activity relationships, and biological properties of 1-heteroaryl-4-[omega-(1H-indol-3-yl)alkyl]piperazines, novel potential antipsychotics combining potent dopamine D2 receptor antagonism with potent serotonin reuptake inhibition. J Med Chem48:6855-69 (2005) 
 
Sodium-dependent serotonin transporter
Name:Sodium-dependent serotonin transporter
Type:Multi-pass membrane protein
Mol. Mass.:70168.43
Organism:Rattus norvegicus (rat)
Description:P31652
Residue:630
BDBM50176032
NameBDBM50176032
Synonyms:3-[3-(4-Chroman-5-yl-piperazin-1-yl)-propyl]-1H-indole | CHEMBL198812
TypeSmall organic molecule
Emp. Form.C24H29N3O
Mol. Mass.375.5066
SMILESC(CN1CCN(CC1)c1cccc2OCCCc12)Cc1c[nH]c2ccccc12