Reaction Details
TargetSodium-dependent serotonin transporter
LigandBDBM50176029
Substrate/Competitorn/a
Meas. Tech.ChEMBL_320901 (CHEMBL872400)
Ki 1.5±n/a nM
Citation Smid, PCoolen, HKKeizer, HGvan Hes, Rde Moes, JPden Hartog, APStork, BPlekkenpol, RHNiemann, LCStroomer, CNTulp, MTvan Stuivenberg, HHMcCreary, ACHesselink, MBHerremans, AHKruse, CG Synthesis, structure-activity relationships, and biological properties of 1-heteroaryl-4-[omega-(1H-indol-3-yl)alkyl]piperazines, novel potential antipsychotics combining potent dopamine D2 receptor antagonism with potent serotonin reuptake inhibition. J Med Chem48:6855-69 (2005) 
 
Sodium-dependent serotonin transporter
Name:Sodium-dependent serotonin transporter
Type:Multi-pass membrane protein
Mol. Mass.:70168.43
Organism:Rattus norvegicus (rat)
Description:P31652
Residue:630
BDBM50176029
NameBDBM50176029
Synonyms:8-{4-[3-(1H-Indol-3-yl)-propyl]-piperazin-1-yl}-3,4-dihydro-2H-benzo[1,4]oxazine | CHEMBL197665
TypeSmall organic molecule
Emp. Form.C23H28N4O
Mol. Mass.376.4946
SMILESC(CN1CCN(CC1)c1cccc2NCCOc12)Cc1c[nH]c2ccccc12