Reaction Details
TargetSodium-dependent serotonin transporter
LigandBDBM50176049
Substrate/Competitorn/a
Meas. Tech.ChEMBL_320901 (CHEMBL872400)
Ki 0.40±n/a nM
Citation Smid, PCoolen, HKKeizer, HGvan Hes, Rde Moes, JPden Hartog, APStork, BPlekkenpol, RHNiemann, LCStroomer, CNTulp, MTvan Stuivenberg, HHMcCreary, ACHesselink, MBHerremans, AHKruse, CG Synthesis, structure-activity relationships, and biological properties of 1-heteroaryl-4-[omega-(1H-indol-3-yl)alkyl]piperazines, novel potential antipsychotics combining potent dopamine D2 receptor antagonism with potent serotonin reuptake inhibition. J Med Chem48:6855-69 (2005) 
 
Sodium-dependent serotonin transporter
Name:Sodium-dependent serotonin transporter
Type:Multi-pass membrane protein
Mol. Mass.:70168.43
Organism:Rattus norvegicus (rat)
Description:P31652
Residue:630
BDBM50176049
NameBDBM50176049
Synonyms:3-{3-[4-(2,3-Dihydro-benzo[1,4]dioxin-5-yl)-piperazin-1-yl]-propyl}-5-methyl-1H-indole | CHEMBL198107
TypeSmall organic molecule
Emp. Form.C24H29N3O2
Mol. Mass.391.506
SMILESCc1ccc2[nH]cc(CCCN3CCN(CC3)c3cccc4OCCOc34)c2c1