Reaction Details
TargetIntegrase
LigandBDBM50176119
Substrate/Competitorn/a
Meas. Tech.ChEMBL_321394 (CHEMBL880629)
IC50 800±n/a nM
Citation Barreca, MLFerro, SRao, ADe Luca, LZappalà, MMonforte, AMDebyser, ZWitvrouw, MChimirri, A Pharmacophore-based design of HIV-1 integrase strand-transfer inhibitors. J Med Chem48:7084-8 (2005) 
 
Integrase
Name:Integrase
Synonyms:Human immunodeficiency virus type 1 integrase
Type:PROTEIN
Mol. Mass.:32231.48
Organism:Human immunodeficiency virus 1
Description:ChEMBL_90865
Residue:288
BDBM50176119
NameBDBM50176119
TypeSmall organic molecule
Emp. Form.C22H20FNO5
Mol. Mass.397.3963
SMILESCCOC(=O)C(=O)CC(=O)c1cn(Cc2ccc(F)cc2)c2ccc(OC)cc12