Reaction Details
TargetIntegrase
LigandBDBM50123470
Substrate/Competitorn/a
Meas. Tech.ChEMBL_321311 (CHEMBL881407)
IC50 370±n/a nM
Citation Barreca, MLFerro, SRao, ADe Luca, LZappalà, MMonforte, AMDebyser, ZWitvrouw, MChimirri, A Pharmacophore-based design of HIV-1 integrase strand-transfer inhibitors. J Med Chem48:7084-8 (2005) 
 
Integrase
Name:Integrase
Synonyms:Human immunodeficiency virus type 1 integrase
Type:PROTEIN
Mol. Mass.:32231.48
Organism:Human immunodeficiency virus 1
Description:ChEMBL_90865
Residue:288
BDBM50123470
NameBDBM50123470
TypeSmall organic molecule
Emp. Form.C23H17NO2
Mol. Mass.339.3866
SMILESOc1c(ccc2cccnc12)C(=O)c1cccc(Cc2ccccc2)c1