Reaction Details
TargetIntegrase
LigandBDBM50154408
Substrate/Competitorn/a
Meas. Tech.ChEMBL_321433 (CHEMBL880241)
IC50 20±n/a nM
Citation Barreca, MLFerro, SRao, ADe Luca, LZappalà, MMonforte, AMDebyser, ZWitvrouw, MChimirri, A Pharmacophore-based design of HIV-1 integrase strand-transfer inhibitors. J Med Chem48:7084-8 (2005) 
 
Integrase
Name:Integrase
Synonyms:Human immunodeficiency virus type 1 integrase
Type:PROTEIN
Mol. Mass.:32231.48
Organism:Human immunodeficiency virus 1
Description:ChEMBL_90865
Residue:288
BDBM50154408
NameBDBM50154408
TypeSmall organic molecule
Emp. Form.C19H15NO4
Mol. Mass.321.3267
SMILESOC(=O)C(=O)CC(=O)c1cn(Cc2ccccc2)c2ccccc12