Reaction Details
TargetIntegrase
LigandBDBM50176132
Substrate/Competitorn/a
Meas. Tech.ChEMBL_321311 (CHEMBL881407)
IC50 100±n/a nM
Citation Barreca, MLFerro, SRao, ADe Luca, LZappalà, MMonforte, AMDebyser, ZWitvrouw, MChimirri, A Pharmacophore-based design of HIV-1 integrase strand-transfer inhibitors. J Med Chem48:7084-8 (2005) 
 
Integrase
Name:Integrase
Synonyms:Human immunodeficiency virus type 1 integrase
Type:PROTEIN
Mol. Mass.:32231.48
Organism:Human immunodeficiency virus 1
Description:ChEMBL_90865
Residue:288
BDBM50176132
NameBDBM50176132
TypeSmall organic molecule
Emp. Form.C18H16O5
Mol. Mass.312.3166
SMILESCOc1ccc(Cc2ccccc2)cc1C(=O)CC(=O)C(O)=O