Reaction Details
TargetIntegrase
LigandBDBM23402
Substrate/Competitorn/a
Meas. Tech.ChEMBL_321311 (CHEMBL881407)
IC50 10±n/a nM
Citation Barreca, MLFerro, SRao, ADe Luca, LZappalà, MMonforte, AMDebyser, ZWitvrouw, MChimirri, A Pharmacophore-based design of HIV-1 integrase strand-transfer inhibitors. J Med Chem48:7084-8 (2005) 
 
Integrase
Name:Integrase
Synonyms:Human immunodeficiency virus type 1 integrase
Type:PROTEIN
Mol. Mass.:32231.48
Organism:Human immunodeficiency virus 1
Description:ChEMBL_90865
Residue:288
BDBM23402
NameBDBM23402
TypeSmall organic molecule
Emp. Form.C20H19FN4O4S
Mol. Mass.430.453
SMILESOc1c(nc(N2CCCCS2(=O)=O)c2cccnc12)C(=O)NCc1ccc(F)cc1