Reaction Details
Target5-hydroxytryptamine receptor 2B
LigandBDBM50176266
Substrate/Competitorn/a
Meas. Tech.ChEMBL_331165 (CHEMBL854092)
EC50 20±n/a nM
Citation Adams, DRBentley, JMBenwell, KRBickerdike, MJBodkin, CDCliffe, IADourish, CTGeorge, ARKennett, GAKnight, ARMalcolm, CSMansell, HLMisra, AQuirk, KRoffey, JRVickers, SP Pyrrolo(iso)quinoline derivatives as 5-HT(2C) receptor agonists. Bioorg Med Chem Lett16:677-80 (2005) 
 
5-hydroxytryptamine receptor 2B
Name:5-hydroxytryptamine receptor 2B
Type:G Protein-Coupled Receptor (GPCR)
Mol. Mass.:54312.47
Organism:Homo sapiens (Human)
Description:Receptor binding assays were performed using human clone stably expressed in CHO cells.
Residue:481
BDBM50176266
NameBDBM50176266
Synonyms:(S)-N-(benzo[d][1,3]dioxol-5-ylmethyl)-1-(1H-pyrrolo[2,3-f]quinolin-1-yl)propan-2-amine | CHEMBL202458
TypeSmall organic molecule
Emp. Form.C22H21N3O2
Mol. Mass.359.421
SMILESC[C@@H](Cn1ccc2ccc3ncccc3c12)NCc1ccc2OCOc2c1