Reaction Details
Target5-hydroxytryptamine receptor 2B
LigandBDBM50176265
Substrate/Competitorn/a
Meas. Tech.ChEMBL_331168 (CHEMBL854095)
Ki 18±n/a nM
Citation Adams, DRBentley, JMBenwell, KRBickerdike, MJBodkin, CDCliffe, IADourish, CTGeorge, ARKennett, GAKnight, ARMalcolm, CSMansell, HLMisra, AQuirk, KRoffey, JRVickers, SP Pyrrolo(iso)quinoline derivatives as 5-HT(2C) receptor agonists. Bioorg Med Chem Lett16:677-80 (2005) 
 
5-hydroxytryptamine receptor 2B
Name:5-hydroxytryptamine receptor 2B
Type:G Protein-Coupled Receptor (GPCR)
Mol. Mass.:54312.47
Organism:Homo sapiens (Human)
Description:Receptor binding assays were performed using human clone stably expressed in CHO cells.
Residue:481
BDBM50176265
NameBDBM50176265
Synonyms:(S)-1-(5-chloro-1H-pyrrolo[2,3-f]quinolin-1-yl)propan-2-amine | CHEMBL201454
TypeSmall organic molecule
Emp. Form.C14H14ClN3
Mol. Mass.259.734
SMILESC[C@H](N)Cn1ccc2cc(Cl)c3ncccc3c12