Reaction Details
Target5-hydroxytryptamine receptor 2C
LigandBDBM50176266
Substrate/Competitorn/a
Meas. Tech.ChEMBL_331166 (CHEMBL854093)
EC50 42±n/a nM
Citation Adams, DRBentley, JMBenwell, KRBickerdike, MJBodkin, CDCliffe, IADourish, CTGeorge, ARKennett, GAKnight, ARMalcolm, CSMansell, HLMisra, AQuirk, KRoffey, JRVickers, SP Pyrrolo(iso)quinoline derivatives as 5-HT(2C) receptor agonists. Bioorg Med Chem Lett16:677-80 (2005) 
 
5-hydroxytryptamine receptor 2C
Name:5-hydroxytryptamine receptor 2C
Type:G Protein-Coupled Receptor (GPCR)
Mol. Mass.:51836.79
Organism:Homo sapiens (Human)
Description:P28335
Residue:458
BDBM50176266
NameBDBM50176266
Synonyms:(S)-N-(benzo[d][1,3]dioxol-5-ylmethyl)-1-(1H-pyrrolo[2,3-f]quinolin-1-yl)propan-2-amine | CHEMBL202458
TypeSmall organic molecule
Emp. Form.C22H21N3O2
Mol. Mass.359.421
SMILESC[C@@H](Cn1ccc2ccc3ncccc3c12)NCc1ccc2OCOc2c1