Reaction Details
TargetKappa-type opioid receptor
LigandBDBM50176367
Substrate/Competitorn/a
Meas. Tech.ChEMBL_332931 (CHEMBL854075)
Ki 0.5±n/a nM
Citation Chu, GHGu, MCassel, JABelanger, SStabley, GJDeHaven, RNConway-James, NKoblish, MLittle, PJDeHaven-Hudkins, DLDolle, RE Novel phenylamino acetamide derivatives as potent and selective kappa opioid receptor agonists. Bioorg Med Chem Lett16:645-8 (2005) 
 
Kappa-type opioid receptor
Name:Kappa-type opioid receptor
Type:G Protein-Coupled Receptor (GPCR)
Mol. Mass.:42648.76
Organism:Homo sapiens (Human)
Description:P41145
Residue:380
BDBM50176367
NameBDBM50176367
Synonyms:2-(3-cyanophenylamino)-N-((S)-2-((S)-3-hydroxypyrrolidin-1-yl)-1-phenylethyl)-N-methylacetamide | CHEMBL382449
TypeSmall organic molecule
Emp. Form.C22H26N4O2
Mol. Mass.378.4674
SMILESCN([C@H](CN1CC[C@H](O)C1)c1ccccc1)C(=O)CNc1cccc(c1)C#N