Reaction Details
TargetKappa-type opioid receptor
LigandBDBM50176369
Substrate/Competitorn/a
Meas. Tech.ChEMBL_332932 (CHEMBL854076)
EC50 0.05±n/a nM
Citation Chu, GHGu, MCassel, JABelanger, SStabley, GJDeHaven, RNConway-James, NKoblish, MLittle, PJDeHaven-Hudkins, DLDolle, RE Novel phenylamino acetamide derivatives as potent and selective kappa opioid receptor agonists. Bioorg Med Chem Lett16:645-8 (2005) 
 
Kappa-type opioid receptor
Name:Kappa-type opioid receptor
Type:G Protein-Coupled Receptor (GPCR)
Mol. Mass.:42648.76
Organism:Homo sapiens (Human)
Description:P41145
Residue:380
BDBM50176369
NameBDBM50176369
Synonyms:CHEMBL201884 | N-((S)-2-((S)-3-hydroxypyrrolidin-1-yl)-1-phenylethyl)-N-methyl-2-(phenylamino)acetamide
TypeSmall organic molecule
Emp. Form.C21H27N3O2
Mol. Mass.353.458
SMILESCN([C@H](CN1CC[C@H](O)C1)c1ccccc1)C(=O)CNc1ccccc1