Reaction Details
TargetCytochrome P450 2D6
LigandBDBM50176371
Substrate/Competitorn/a
Meas. Tech.ChEMBL_332935 (CHEMBL854082)
IC50 9000±n/a nM
Citation Chu, GHGu, MCassel, JABelanger, SStabley, GJDeHaven, RNConway-James, NKoblish, MLittle, PJDeHaven-Hudkins, DLDolle, RE Novel phenylamino acetamide derivatives as potent and selective kappa opioid receptor agonists. Bioorg Med Chem Lett16:645-8 (2005) 
 
Cytochrome P450 2D6
Name:Cytochrome P450 2D6
Type:Protein
Mol. Mass.:55774.82
Organism:Homo sapiens (Human)
Description:P10635
Residue:497
BDBM50176371
NameBDBM50176371
Synonyms:CHEMBL202267 | N-((S)-2-((S)-3-hydroxypyrrolidin-1-yl)-1-phenylethyl)-N-methyl-2-(4-(propylsulfonamido)phenylamino)acetamide
TypeSmall organic molecule
Emp. Form.C24H34N4O4S
Mol. Mass.474.616
SMILESCCCS(=O)(=O)Nc1ccc(NCC(=O)N(C)[C@H](CN2CC[C@H](O)C2)c2ccccc2)cc1