Reaction Details
TargetKappa-type opioid receptor
LigandBDBM50176362
Substrate/Competitorn/a
Meas. Tech.ChEMBL_332932 (CHEMBL854076)
EC50 2.3±n/a nM
Citation Chu, GHGu, MCassel, JABelanger, SStabley, GJDeHaven, RNConway-James, NKoblish, MLittle, PJDeHaven-Hudkins, DLDolle, RE Novel phenylamino acetamide derivatives as potent and selective kappa opioid receptor agonists. Bioorg Med Chem Lett16:645-8 (2005) 
 
Kappa-type opioid receptor
Name:Kappa-type opioid receptor
Type:G Protein-Coupled Receptor (GPCR)
Mol. Mass.:42648.76
Organism:Homo sapiens (Human)
Description:P41145
Residue:380
BDBM50176362
NameBDBM50176362
Synonyms:2-((4-cyanophenyl)(methyl)amino)-N-((S)-2-((S)-3-hydroxypyrrolidin-1-yl)-1-phenylethyl)-N-methylacetamide | CHEMBL203306
TypeSmall organic molecule
Emp. Form.C23H28N4O2
Mol. Mass.392.494
SMILESCN(CC(=O)N(C)[C@H](CN1CC[C@H](O)C1)c1ccccc1)c1ccc(cc1)C#N