Reaction Details
TargetcAMP-specific 3',5'-cyclic phosphodiesterase 4B
LigandBDBM14361
Substrate/Competitorn/a
Meas. Tech.ChEMBL_334420 (CHEMBL854102)
IC50 625±n/a nM
Citation Chambers, RJAbrams, KCastleberry, TACheng, JBFisher, DAKamath, AVMarfat, ANettleton, DOPillar, JDSalter, EDSheils, ALShirley, JTTurner, CRUmland, JPLam, KT A new chemical tool for exploring the role of the PDE4D isozyme in leukocyte function. Bioorg Med Chem Lett16:718-21 (2005) 
 
cAMP-specific 3',5'-cyclic phosphodiesterase 4B
Name:cAMP-specific 3',5'-cyclic phosphodiesterase 4B
Type:Protein
Mol. Mass.:83318.87
Organism:Homo sapiens (Human)
Description:Q07343
Residue:736
BDBM14361
NameBDBM14361
Synonyms:(R,S)-Rolipram 4-[3-(cyclopentyloxy)-4-methoxyphenyl]pyrrolidin-2-one CHEMBL63 | Rolipram
TypeSmall organic molecule
Emp. Form.C16H21NO3
Mol. Mass.275.3428
SMILESCOc1ccc(cc1OC1CCCC1)C1CNC(=O)C1