Reaction Details
TargetRNA-directed RNA polymerase
LigandBDBM50176483
Substrate/Competitorn/a
Meas. Tech.ChEMBL_329786 (CHEMBL864623)
IC50 750±n/a nM
Citation Gopalsamy, AAplasca, ACiszewski, GPark, KEllingboe, JWOrlowski, MFeld, BHowe, AY Design and synthesis of 3,4-dihydro-1H-[1]-benzothieno[2,3-c]pyran and 3,4-dihydro-1H-pyrano[3,4-b]benzofuran derivatives as non-nucleoside inhibitors of HCV NS5B RNA dependent RNA polymerase. Bioorg Med Chem Lett16:457-60 (2005) 
 
RNA-directed RNA polymerase
Name:RNA-directed RNA polymerase
Type:Protein
Mol. Mass.:25173.95
Organism:Hepatitis C virus
Description:Q8JXU8
Residue:229
BDBM50176483
NameBDBM50176483
Synonyms:(1-butyl-5,8-dichloro-3,4-dihydro-1H-benzo[4,5]thieno[2,3-c]pyran-1-yl)-acetic acid | CHEMBL201681
TypeSmall organic molecule
Emp. Form.C17H18Cl2O3S
Mol. Mass.373.294
SMILESCCCCC1(CC(O)=O)OCCc2c1sc1c(Cl)ccc(Cl)c21