Reaction Details
TargetRNA-directed RNA polymerase
LigandBDBM50176490
Substrate/Competitorn/a
Meas. Tech.ChEMBL_329786 (CHEMBL864623)
IC50 16300±n/a nM
Citation Gopalsamy, AAplasca, ACiszewski, GPark, KEllingboe, JWOrlowski, MFeld, BHowe, AY Design and synthesis of 3,4-dihydro-1H-[1]-benzothieno[2,3-c]pyran and 3,4-dihydro-1H-pyrano[3,4-b]benzofuran derivatives as non-nucleoside inhibitors of HCV NS5B RNA dependent RNA polymerase. Bioorg Med Chem Lett16:457-60 (2005) 
 
RNA-directed RNA polymerase
Name:RNA-directed RNA polymerase
Type:Protein
Mol. Mass.:25173.95
Organism:Hepatitis C virus
Description:Q8JXU8
Residue:229
BDBM50176490
NameBDBM50176490
Synonyms:(5,8-dichloro-1-ethyl-3,4-dihydro-1H-benzo[4,5]furo[2,3-c]pyran-1-yl)-acetic acid | CHEMBL200356
TypeSmall organic molecule
Emp. Form.C15H14Cl2O4
Mol. Mass.329.175
SMILESCCC1(CC(O)=O)OCCc2c1oc1c(Cl)ccc(Cl)c21