Reaction Details
TargetProstaglandin G/H synthase 1
LigandBDBM23926
Substrate/Competitorn/a
Meas. Tech.ChEMBL_329196 (CHEMBL863436)
IC50 195500±n/a nM
Citation Vilar, SQuezada, ESantana, LUriarte, EYánez, MFraiz, NAlcaide, CCano, EOrallo, F Design, synthesis, and vasorelaxant and platelet antiaggregatory activities of coumarin-resveratrol hybrids. Bioorg Med Chem Lett16:257-61 (2005) 
 
Prostaglandin G/H synthase 1
Name:Prostaglandin G/H synthase 1
Type:Enzyme
Mol. Mass.:68692.62
Organism:Homo sapiens (Human)
Description:P23219
Residue:599
BDBM23926
NameBDBM23926
Synonyms:(E)-resveratrol CHEMBL165 Stilbene, 2f cid_445154 trans-resveratrol
TypeSmall organic molecule
Emp. Form.C14H12O3
Mol. Mass.228.2433
SMILESOc1ccc(\C=C\c2cc(O)cc(O)c2)cc1