Reaction Details
TargetAmyloid-beta precursor protein
LigandBDBM50176892
Substrate/Competitorn/a
Meas. Tech.ChEMBL_430883 (CHEMBL913952)
Ki 15.6±n/a nM
Citation Ono, MYoshida, NIshibashi, KHaratake, MArano, YMori, HNakayama, M Radioiodinated flavones for in vivo imaging of beta-amyloid plaques in the brain. J Med Chem48:7253-60 (2005) 
 
Amyloid-beta precursor protein
Name:Amyloid-beta precursor protein
Type:Single-pass type I membrane protein
Mol. Mass.:86890.41
Organism:Homo sapiens (Human)
Description:P05067
Residue:770
BDBM50176892
NameBDBM50176892
Synonyms:6-iodo-4'-dimethyaminoflavone | CHEMBL375934
TypeSmall organic molecule
Emp. Form.C17H14INO2
Mol. Mass.391.203
SMILESCN(C)c1ccc(cc1)-c1cc(=O)c2cc(I)ccc2o1