Reaction Details
TargetAmyloid-beta precursor protein
LigandBDBM50100134
Substrate/Competitorn/a
Meas. Tech.ChEMBL_430882 (CHEMBL913951)
Ki>1000±n/a nM
Citation Ono, MYoshida, NIshibashi, KHaratake, MArano, YMori, HNakayama, M Radioiodinated flavones for in vivo imaging of beta-amyloid plaques in the brain. J Med Chem48:7253-60 (2005) 
 
Amyloid-beta precursor protein
Name:Amyloid-beta precursor protein
Type:Single-pass type I membrane protein
Mol. Mass.:86890.41
Organism:Homo sapiens (Human)
Description:P05067
Residue:770
BDBM50100134
NameBDBM50100134
Synonyms:2-(4-Dimethylamino-phenyl)-3,6-dimethyl-benzothiazol-3-ium 2-[4-(dimethylamino)phenyl]-3,6-dimethyl-1,3-benzothiazol-3-ium CHEMBL57267 Thioflavin T, 1 cid_16954
TypeSmall organic molecule
Emp. Form.C17H19N2S
Mol. Mass.283.411
SMILESCN(C)c1ccc(cc1)-c1sc2cc(C)ccc2[n+]1C