Reaction Details
TargetAmyloid-beta precursor protein
LigandBDBM50176895
Substrate/Competitorn/a
Meas. Tech.ChEMBL_430882 (CHEMBL913951)
Ki 72.5±n/a nM
Citation Ono, MYoshida, NIshibashi, KHaratake, MArano, YMori, HNakayama, M Radioiodinated flavones for in vivo imaging of beta-amyloid plaques in the brain. J Med Chem48:7253-60 (2005) 
 
Amyloid-beta precursor protein
Name:Amyloid-beta precursor protein
Type:Single-pass type I membrane protein
Mol. Mass.:86890.41
Organism:Homo sapiens (Human)
Description:P05067
Residue:770
BDBM50176895
NameBDBM50176895
Synonyms:6-iodo-4'-hydroxyflavone | CHEMBL388844
TypeSmall organic molecule
Emp. Form.C15H9IO3
Mol. Mass.364.1346
SMILESOc1ccc(cc1)-c1cc(=O)c2cc(I)ccc2o1