Reaction Details
TargetAmyloid-beta precursor protein
LigandBDBM50176894
Substrate/Competitorn/a
Meas. Tech.ChEMBL_430883 (CHEMBL913952)
Ki 38.3±n/a nM
Citation Ono, MYoshida, NIshibashi, KHaratake, MArano, YMori, HNakayama, M Radioiodinated flavones for in vivo imaging of beta-amyloid plaques in the brain. J Med Chem48:7253-60 (2005) 
 
Amyloid-beta precursor protein
Name:Amyloid-beta precursor protein
Type:Single-pass type I membrane protein
Mol. Mass.:86890.41
Organism:Homo sapiens (Human)
Description:P05067
Residue:770
BDBM50176894
NameBDBM50176894
Synonyms:6-iodo-4'-methoxyflavone | CHEMBL224064
TypeSmall organic molecule
Emp. Form.C16H11IO3
Mol. Mass.378.1612
SMILESCOc1ccc(cc1)-c1cc(=O)c2cc(I)ccc2o1