Reaction Details
TargetAmyloid-beta precursor protein
LigandBDBM50176896
Substrate/Competitorn/a
Meas. Tech.ChEMBL_430882 (CHEMBL913951)
Ki 22.6±n/a nM
Citation Ono, MYoshida, NIshibashi, KHaratake, MArano, YMori, HNakayama, M Radioiodinated flavones for in vivo imaging of beta-amyloid plaques in the brain. J Med Chem48:7253-60 (2005) 
 
Amyloid-beta precursor protein
Name:Amyloid-beta precursor protein
Type:Single-pass type I membrane protein
Mol. Mass.:86890.41
Organism:Homo sapiens (Human)
Description:P05067
Residue:770
BDBM50176896
NameBDBM50176896
Synonyms:6-iodo-4'-methylaminoflavone | CHEMBL224643
TypeSmall organic molecule
Emp. Form.C16H12INO2
Mol. Mass.377.1765
SMILESCNc1ccc(cc1)-c1cc(=O)c2cc(I)ccc2o1