Reaction Details
TargetCannabinoid receptor 2
LigandBDBM50176985
Substrate/Competitorn/a
Meas. Tech.ChEMBL_430952 (CHEMBL914894)
Ki 1.45±n/a nM
Citation Murineddu, GRuiu, SLoriga, GManca, ILazzari, PReali, RPani, LToma, LPinna, GA Tricyclic pyrazoles. 3. Synthesis, biological evaluation, and molecular modeling of analogues of the cannabinoid antagonist 8-chloro-1-(2',4'-dichlorophenyl)-N-piperidin-1-yl-1,4,5,6-tetrahydrobenzo[6,7]cyclohepta[1,2-c]pyrazole-3-carboxamide. J Med Chem48:7351-62 (2005) 
 
Cannabinoid receptor 2
Name:Cannabinoid receptor 2
Type:Enzyme Catalytic Domain
Mol. Mass.:38220.43
Organism:MOUSE
Description:P47936
Residue:347
BDBM50176985
NameBDBM50176985
Synonyms:8-chloro-1-(2',4'-dichlorophenyl)-N-phenyl-1,4,5,6-tetrahydrobenzo[6,7]cyclohepta[1,2-c]pyrazole-3-carboxamide | CHEMBL225377
TypeSmall organic molecule
Emp. Form.C25H18Cl3N3O
Mol. Mass.482.789
SMILESClc1ccc(c(Cl)c1)-n1nc(C(=O)Nc2ccccc2)c2CCCc3cc(Cl)ccc3-c12