Reaction Details
TargetCannabinoid receptor 1
LigandBDBM50176982
Substrate/Competitorn/a
Meas. Tech.ChEMBL_430951 (CHEMBL914893)
Ki 31.2±n/a nM
Citation Murineddu, GRuiu, SLoriga, GManca, ILazzari, PReali, RPani, LToma, LPinna, GA Tricyclic pyrazoles. 3. Synthesis, biological evaluation, and molecular modeling of analogues of the cannabinoid antagonist 8-chloro-1-(2',4'-dichlorophenyl)-N-piperidin-1-yl-1,4,5,6-tetrahydrobenzo[6,7]cyclohepta[1,2-c]pyrazole-3-carboxamide. J Med Chem48:7351-62 (2005) 
 
Cannabinoid receptor 1
Name:Cannabinoid receptor 1
Type:Enzyme
Mol. Mass.:52842.52
Organism:Mus musculus (Mouse)
Description:P47746
Residue:473
BDBM50176982
NameBDBM50176982
Synonyms:9-chloro-1-(2',4'-dichlorophenyl)-N-piperidin-1-yl-1,4,5,6-tetrahydrobenzo[6,7]cyclohepta[1,2-c]pyrazole-3-carboxamide | CHEMBL224053
TypeSmall organic molecule
Emp. Form.C24H23Cl3N4O
Mol. Mass.489.825
SMILESClc1ccc(c(Cl)c1)-n1nc(C(=O)NN2CCCCC2)c2CCCc3ccc(Cl)cc3-c12