Reaction Details
TargetCannabinoid receptor 1
LigandBDBM50176977
Substrate/Competitorn/a
Meas. Tech.ChEMBL_430951 (CHEMBL914893)
Ki 2050±n/a nM
Citation Murineddu, GRuiu, SLoriga, GManca, ILazzari, PReali, RPani, LToma, LPinna, GA Tricyclic pyrazoles. 3. Synthesis, biological evaluation, and molecular modeling of analogues of the cannabinoid antagonist 8-chloro-1-(2',4'-dichlorophenyl)-N-piperidin-1-yl-1,4,5,6-tetrahydrobenzo[6,7]cyclohepta[1,2-c]pyrazole-3-carboxamide. J Med Chem48:7351-62 (2005) 
 
Cannabinoid receptor 1
Name:Cannabinoid receptor 1
Type:Enzyme
Mol. Mass.:52842.52
Organism:Mus musculus (Mouse)
Description:P47746
Residue:473
BDBM50176977
NameBDBM50176977
Synonyms:1,4-dihydroindeno[1,2-c]-pyrazole CHEMBL218957
TypeSmall organic molecule
Emp. Form.C22H19Cl3N4O
Mol. Mass.461.771
SMILESClc1ccc-2c(Cc3c(nn(c-23)-c2ccc(Cl)cc2Cl)C(=O)NN2CCCCC2)c1