Reaction Details
TargetCannabinoid receptor 2
LigandBDBM50176979
Substrate/Competitorn/a
Meas. Tech.ChEMBL_430952 (CHEMBL914894)
Ki 0.46±n/a nM
Citation Murineddu, GRuiu, SLoriga, GManca, ILazzari, PReali, RPani, LToma, LPinna, GA Tricyclic pyrazoles. 3. Synthesis, biological evaluation, and molecular modeling of analogues of the cannabinoid antagonist 8-chloro-1-(2',4'-dichlorophenyl)-N-piperidin-1-yl-1,4,5,6-tetrahydrobenzo[6,7]cyclohepta[1,2-c]pyrazole-3-carboxamide. J Med Chem48:7351-62 (2005) 
 
Cannabinoid receptor 2
Name:Cannabinoid receptor 2
Type:Enzyme Catalytic Domain
Mol. Mass.:38220.43
Organism:MOUSE
Description:P47936
Residue:347
BDBM50176979
NameBDBM50176979
Synonyms:8-methyl-1-(2',4'-dichlorophenyl)-N-piperidin-1-yl-1,4,5,6-tetrahydrobenzo[6,7]cyclohepta[1,2-c]pyrazole-3-carboxamide | CHEMBL224609
TypeSmall organic molecule
Emp. Form.C25H26Cl2N4O
Mol. Mass.469.406
SMILESCc1ccc2-c3c(CCCc2c1)c(nn3-c1ccc(Cl)cc1Cl)C(=O)NN1CCCCC1