Reaction Details
TargetC-X-C chemokine receptor type 2
LigandBDBM50177605
Substrate/Competitorn/a
Meas. Tech.ChEMBL_334048 (CHEMBL862382)
IC50 3900±n/a nM
Citation Baxter, ACooper, AKinchin, EMoakes, KUnitt, JWallace, A Hit-to-Lead studies: the discovery of potent, orally bioavailable thiazolopyrimidine CXCR2 receptor antagonists. Bioorg Med Chem Lett16:960-3 (2006) 
 
C-X-C chemokine receptor type 2
Name:C-X-C chemokine receptor type 2
Type:Protein
Mol. Mass.:40767.88
Organism:Homo sapiens (Human)
Description:P25025
Residue:360
BDBM50177605
NameBDBM50177605
Synonyms:(S)-2-(2-amino-5-(benzylthio)thiazolo[4,5-d]pyrimidin-7-ylamino)butan-1-ol | CHEMBL383235
TypeSmall organic molecule
Emp. Form.C16H19N5OS2
Mol. Mass.361.485
SMILESCC[C@@H](CO)Nc1nc(SCc2ccccc2)nc2nc(N)sc12