Reaction Details
TargetC-X-C chemokine receptor type 2
LigandBDBM50177615
Substrate/Competitorn/a
Meas. Tech.ChEMBL_334048 (CHEMBL862382)
IC50 9.5±n/a nM
Citation Baxter, ACooper, AKinchin, EMoakes, KUnitt, JWallace, A Hit-to-Lead studies: the discovery of potent, orally bioavailable thiazolopyrimidine CXCR2 receptor antagonists. Bioorg Med Chem Lett16:960-3 (2006) 
 
C-X-C chemokine receptor type 2
Name:C-X-C chemokine receptor type 2
Type:Protein
Mol. Mass.:40767.88
Organism:Homo sapiens (Human)
Description:P25025
Residue:360
BDBM50177615
NameBDBM50177615
Synonyms:(R)-2-(5-(2,3-difluorobenzylthio)-2-aminothiazolo[4,5-d]pyrimidin-7-ylamino)butan-1-ol | CHEMBL380732
TypeSmall organic molecule
Emp. Form.C16H17F2N5OS2
Mol. Mass.397.466
SMILESCC[C@H](CO)Nc1nc(SCc2cccc(F)c2F)nc2nc(N)sc12